{"text_format":"1","workbook":"xlsx","n_sheets":9,"sheets":["Instructivo","Estructura","Diagnóstico_RR","Formulas","Segunda línea","Mapa de Aseguramiento","Hoja1","Hoja3","Hoja2"],"not_rendered":{"charts":0,"images":2,"macros":1,"external_links":2,"defined_names":9,"comments":1,"pivot_tables":0},"unopened":[],"bounds":{"document_bytes":16777216,"sheet_cells":100000,"rows_first":2000,"rows_last":500,"rows_between":2000,"halvings":0,"cell_chars":16384,"cell_head_chars":4096},"cells_cut":0,"cells_raw":0,"read":"row_number_cap","date_system":"1900"}

{"sheet":"Instructivo","index":0,"n_rows":7,"n_cols":3,"rows_kept":7,"cut":false,"hidden":false,"merged":[[1,1,1,17],[3,1,3,17],[6,2,90,16]]}
[]
[null,"ESTRUCTURA LÍNEAS DE DEFENSA "]
[]
[null,"INSTRUCCIONES DE DILIGENCIAMIENTO"]
[]
[]
[null,null,"Este archivo hace parte de un conjunto de herramientas que le permitirán desarrollar un ejercicio de identificación del modelo de las líneas de defensa  con el propósito de que la entidad establezca e identifique las responsabilidades y roles que se distribuye a través de sus servidores frente a la gestión del riesgo y el control. Este instrumento se constituye como una guía para facilitar el proceso de estructuración de las líneas de defensa. \nEste archivo cuenta con cuatro (4) hojas de Excel de interés para quien lo diligencie, las cuales se explicaran a continuación:\n\nESTRUCTURA LÍNEAS DE DEFENSA:\n\nLa presentación de este archivo busca que el usuario conozca los conceptos básicos para desarrollar el ejercicio de líneas de defensa en su entidad.  Por esta razón, presenta la estructura de cada una de las líneas de defensa consideradas en este modelo a través de la descripción de sus integrantes y las responsabilidades generales ; dicha estructura corresponde a la presentada en el Manual Operativo del MIPG - Versión 2. \n\nDIAGNÓSTICO DE ROLES Y RESPONSABILIDADES:\n\nCorresponde al primer archivo que el usuario debe diligenciar, para ello debe tener en cuenta las siguientes consideraciones:\n\nAspectos claves de éxito: corresponden a los programas, proyectos, procesos, sistemas, entre otros de la entidad que agregan valor para el cumplimiento de los objetivos institucionales. El listado presentado corresponde a un ejemplo de algunos aspectos claves los cuales pueden ser modificados y ajustados a la operación de la entidad.  \n\nResponsables- Cargo: Corresponde a los posibles cargos que se pueden encontrar en una entidad. El listado presentado corresponde a un ejemplo de algunos cargos. \n\nModo de diligenciamiento: teniendo en cuenta los aspectos claves de éxito listados sobre las filas y los responsables listados sobre las columnas, se deben identificar los responsables sobre cada uno de los componentes de los aspectos claves. En la parte superior del archivo se presentan cuatro componentes (Planear, Aprobar, Ejecutar y Verificar) que deben ser ubicados en la casilla en la que se entrecruce un aspecto clave de éxito con un responsable. Cada componente asociado a un aspecto puede tener uno o más responsables por lo que puede estar ubicado en una o más casillas al mismo tiempo. \nA continuación se presenta un ejemplo de diligenciamiento: \n \nComo se evidencia en el ejemplo del aspecto clave de éxito de la gestión del talento humano, la responsabilidad sobre los cuatro componentes recae sobre 3 cargos de la siguiente manera:\nRepresentante legal: Aprua\nJefe de Oficina (quien en este caso puede ser el director o coordinador de talento humano) – Planea, Verifica y Ejecuta. \nProfesional – Ejecuta. \nEn el ejemplo, el jefe de oficina y el profesional llevan a cabo tareas de ejecución porque pueden ejecutar diferentes etapas asociadas a la gestión del talento humano. De la misma manera, en la práctica cada uno de los componentes (Planear, Verificar, Aprobar y Ejecutar) puede ser llevado a cabo por uno o más cargos o responsables.\n \nIDENTIFICACIÓN SEGUNDA LINEA DE DEFENSA \n\nEl archivo asociado a la identificación de la segunda línea de defensa tiene en cuenta los aspectos clave de éxito enunciados en el archivo de diagnóstico de roles y responsabilidades. El objetivo de este documento es identificar para cuales actividades de éxito existe una segunda línea de defensa y para cuáles no. \nEl diligenciamiento de cada una de las columnas del archivo se describe a continuación: \nAspectos clave de éxito: son los mismos aspectos clave enunciados en el archivo de roles y responsabilidades y sobre los cuales se evaluara la existencia de una segunda línea de defensa.\nRiesgo Asociado: para cada uno de los aspectos clave se deben identificar uno o más riesgos sobre los cuales se han establecido controles. \nResponsable: Al interior de la entidad debe haber uno o varios responsables sobre un aspecto clave de éxito. En esta casilla deben colocarse todos los responsables de los que se tenga conocimiento están asociados al aspecto clave de éxito. \nÁrea Funcional: Los responsables pertenecen a áreas funcionales por lo que se debe identificar las mismas. Por otro lado, existe la posibilidad de que no haya un responsable individual de un aspecto de éxito sino que dicha responsabilidad recaiga en un área funcional como un todo. En este caso, se debe identificar el área encargada. \n\nUna vez se identifiquen los aspectos clave de éxito, los riesgos asociados al mismo y los responsables del aspecto clave, se procede a identificar si estos pertenecen o no a la segunda línea de defensa. Para tales fines se debe dar respuesta a 3 preguntas que se definen como 3 criterios. \nCriterios para la identificación de la segunda línea de defensa: \n• ¿El responsable o área funcional encargada del aspecto clave de éxito pertenece a la Media o Alta Gerencia?\n• ¿El área funcional o responsable responde ante la Alta Dirección por el aspecto clave de éxito?\n• ¿El área funcional o responsable realiza actividades de seguimiento?\nEn caso de que la respuesta sea afirmativa, se debe colocar una X en la casilla asociada a cada una de las preguntas. \nClasificación: esta casilla se llena automáticamente una vez se responden los criterios para la identificación de la segunda línea de defensa. De esta manera, el usuario sabrá de inmediato si de acuerdo a las características identificadas el responsable pertenece a la primera o a la segunda línea de defensa. \nPara las actividades en las que la clasificación resulte en la primera línea de defensa no se debe seguir diligenciando el archivo. Por otro lado, aquellas actividades para las que se identifique una segunda línea de defensa deben diligenciar las columnas restantes. \nFunciones de aseguramiento: las funciones de aseguramiento son aquellas funciones que se llevan a cabo sobre los controles que se han establecido en la primera línea de defensa. Una función de aseguramiento tiene un carácter global a comparación de los controles que han sido establecidos de manera directa para el manejo de riesgos. \nCriterios evaluadores de la función de aseguramiento: Existen 4 criterios bajo los cuales se evalúa si una función de aseguramiento ha sido establecida de manera adecuada: \n• Establecimiento del objetivo y alcance de la función de aseguramiento. \n• Metodología establecida para la función de aseguramiento. \n• Si la función de aseguramiento cuenta con responsables claramente definidos. \n• Metodología para la comunicación de resultados y el manejo de información. \nEn la casilla asociada a cada uno de estos criterios el usuario debe colocar un numero entre 1 y 5 de acuerdo a como considere se lleve dicha tarea en su entidad. Una vez se han colocado los 4 valores, se obtendrá un total que determinará el nivel de confianza de aseguramiento provisto por la función descrita. Dicho nivel de confianza puede ser bajo, medio o alto. \nLas columnas no especificadas en este instructivo se diligencian de manera automática a medida que el usuario agrega información dentro del archivo. \n\nINTERPRETACIÓN NIVEL DE ASEGURAMIENTO\n\nEste archivo es de carácter informativo y se presenta con el objetivo de que el usuario pueda interpretar con mayor facilidad que quiere decir tener un nivel bajo, medio o alto de aseguramiento y cuáles son las implicaciones que dicha valoración puede traer y las acciones que se deben tomar. \n\nMAPA DE ASEGURAMIENTO \n\nEl mapa de aseguramiento busca consolidar la información de la segunda y tercera líneas de defensa de la entidad relacionando los aspectos clave de éxito, los riesgos asociados al mismo, sus responsables y áreas funcionales. \nLa información aquí consolidada proviene de los otros archivos que han sido previamente diligenciados. \n\n"]

{"sheet":"Estructura","index":1,"n_rows":10,"n_cols":4,"rows_kept":10,"cut":false,"hidden":false,"merged":[[0,1,1,1],[0,2,0,3],[1,2,1,3],[3,1,3,2]]}
[null,null,"ESTRUCTURA LÍNEAS DE DEFENSA "]
[]
[]
[]
[]
[null,"LÍNEAS DE DEFENSA ","INTEGRANTES ","RESPONSABILIDAD"]
[null,"Línea Estratégica","Alta Dirección y Comité Institucional de Coordinación de Control Interno.\n","Tendrá la responsabilidad de definir el marco general para la gestión del riesgo (política de administración del riesgo) y garantizar el cumplimiento de los planes de la entidad.\n\nAnaliza los riesgos y amenazas institucionales al cumplimiento del os planes estratégicos (objetivos, metas, indicadores)"]
[null,"Primera Línea de Defensa","Dependiendo de la estructura organizacional de la entidad (organigrama), Líderes de proceso y sus equipos (En general servidores públicos en todos los niveles de la organización).","Garantizan la gestión en el día a día, en conjunto con sus equipos de trabajo.\n\nSe encarga de identificar, evaluar, controlar y mitigar los riesgos.\n\nSon responsables de implementar acciones correctivas y detectar fallas en los controles."]
{"$rows_left_out":3}
{"sheet":"Diagnóstico_RR","index":2,"n_rows":267,"n_cols":5,"rows_kept":267,"cut":false,"hidden":true,"merged":[[241,0,248,0],[241,1,248,1],[250,0,257,0],[250,1,257,1],[259,0,266,0],[259,1,266,1],[214,0,221,0],[214,1,221,1],[223,0,230,0],[223,1,230,1],[232,0,239,0],[232,1,239,1],[187,0,194,0],[187,1,194,1],[196,0,203,0],[196,1,203,1],[205,0,212,0],[205,1,212,1],[160,0,167,0],[160,1,167,1],[169,0,176,0],[169,1,176,1],[178,0,185,0],[178,1,185,1],[115,0,122,0],[124,0,131,0],[133,0,140,0],[142,0,149,0],[151,0,158,0],[124,1,131,1],[133,1,140,1],[142,1,149,1],[151,1,158,1],[16,0,23,0],[25,0,32,0],[34,0,41,0],[43,0,50,0],[52,0,59,0],[61,0,68,0],[70,0,77,0],[79,0,86,0],[88,0,95,0],[97,0,104,0],[106,0,113,0],[79,1,86,1],[88,1,95,1],[97,1,104,1],[106,1,113,1],[115,1,122,1],[43,1,50,1],[52,1,59,1],[61,1,68,1],[70,1,77,1],[7,1,14,1],[7,0,14,0],[16,1,23,1],[25,1,32,1],[34,1,41,1],[4,4,5,4],[0,2,0,4],[1,2,1,4],[0,0,1,1],[2,0,2,4],[3,1,5,1],[3,2,3,4],[3,0,5,0],[4,2,5,2],[4,3,5,3]]}
[null,null,"DIAGNÓSTICO DE ROLES Y RESPONSABILIDADES"]
[null,null,{"$f":"Estructura!C2","v":0}]
["P: Planea o diseña la actividad     A: Aprueba la actividad o su salida (producto/servicio)    \nE: Ejecuta la actividad                     V: Verifica la actividad "]
["No. ","ASPECTO CLAVE DE ÉXITO\n(Programa, Proyecto, Proceso, Sistema, entre otros)","RESPONSABLE - CARGO"]
[null,null,"CARGO","AREA","COMPONENTE"]
[]
[]
[1,"Planeación Estratégica","Seleccione…",null,"Seleccione…"]
{"$rows_left_out":260}
{"sheet":"Formulas","index":3,"n_rows":18,"n_cols":2,"rows_kept":18,"cut":false,"hidden":true,"merged":[]}
["Opciones","Cargos"]
["Seleccione…","Seleccione…"]
["P","Representante Legal"]
["A","Secretario"]
["E","Director / Jefe de Oficina"]
["V","Coordinador"]
["P-A","Asesor"]
["P-E","Profesional"]
{"$rows_left_out":11}
{"sheet":"Segunda línea","index":4,"n_rows":17,"n_cols":24,"rows_kept":17,"cut":false,"hidden":false,"merged":[[4,15,5,15],[4,21,5,21],[4,12,5,12],[4,13,5,13],[4,11,5,11],[3,23,5,23],[4,10,5,10],[1,3,1,23],[0,3,0,23],[4,22,5,22],[3,1,3,22],[4,2,5,2],[4,1,5,1],[4,6,4,8],[4,3,5,3],[4,4,5,4],[4,5,5,5],[4,9,5,9],[4,14,5,14],[4,16,4,19],[0,1,1,2]],"read":"row_number_cap"}
[null,null,null,"ESTRUCTURA SEGUNDA LÍNEA DE DEFENSA"]
[null,null,null,{"$f":"Diagnóstico_RR!C2","v":0}]
[]
[null,"SEGUNDA LÍNEA DE DEFENSA",null,null,null,null,null,null,null,null,null,null,null,null,null,null,null,null,null,null,null,null,null,"TERCERA LÍNEA DE DEFENSA\n(Oficina de Control Interno o quien haga sus veces) "]
[null,"No. ","ASPECTO CLAVE DE ÉXITO\n(Programa, Proyecto, Proceso, Sistema, entre otros)","Riesgo asociado al aspecto clave de éxito","Responsable","Area Funcional","Criterios para la identificación de la segunda línea de defensa",null,null,"Clasificación ","FUNCIONES DE  ASEGURAMIENTO","RESPONSABLE ","FECHA/PERIODICIDAD CUMPLIMIENTO","SOPORTE","OBSERVACIONES","Atributos Función de Aseguramiento o Actividad de Control para la evaluación de confianza","CRITERIOS EVALUADORES DE LA FUNCIÓN DE ASEGURAMIENTO",null,null,null,null,"NIVEL DE \nCONFIANZA","OBSERVACIÓN"]
[null,null,null,null,null,null,"¿Pertenece a la Media o Alta Gerencia?","¿Responde ante la Alta Dirección?","¿Realiza actividades de seguimiento trasversal?",null,null,null,null,null,null,null,"Objetivo y Alcance  de la funcion de aseguramiento\n(20%)","Metodología\n(30%)","Responsable\n(30%)","Comunicación de resultados \n(20%)","Total"]
[{"$f":"CONCATENATE(J7,B7)","v":"Segunda Línea de Defensa1"},1,"Direccionamiento Estrategico\n\n (Planeación Estratégica)","Alto","Director / Jefe de Oficina","Oficina Asesora de Planeación","X","X","X",{"$f":"IF(COUNTIF(G7:I7,\"X\")=3,\"Segunda Línea de Defensa\",IF(COUNTIF(G7:I7,\"X\")=2,\"Primera Línea de Defensa\",IF(COUNTIF(G7:I7,\"X\")=1,\"Primera Línea de Defensa\",)))","v":"Segunda Línea de Defensa"},"Efectuar monitoreo institucional a la planeacion estrategica","GIT Proyectos y Presupuesto ","Semestral ","Informe y/o reporte general del avance  de la ejecución del Plan Acción Institucional ",null,"Los profesionales del GIT de presupuesto de la OAP verifican trimestralmente el avance reportado en el plan de acción sobre las metas de los productos relacionados con las apuestas estrategicas y la planeación de la entidad. Esta información es reportada por los procesos en el aplicativo Kawak, posteriormente se genera un informe que contiene el avance ponderado de cumplimiento de sus objetivos estratégicos e institucionales, el cual es enviado vía correo electrónico a los lideres de proceso para su conocimiento, generando las alertas que haya a lugar y su correspondiente seguimiento y se publica en la página web de la entidad.\nPresentar informe semestral a la Oficina Asesora de Control Interno en el cual se informara sobre aquellos aspectos criticos que consideren pueden generar un riesgo en la entidad. En caso de presentar una situación critica se debe informar de manera inmediata a la Oficina de Control Interno.",4,4,4,4,{"$f":"(Q7*0.2)+(R7*0.3)+(S7*0.3)+(T7*0.2)","v":4},{"$f":"IF(U7<0.9,\" \",IF(U7<3,\"Bajo Aseguramiento\",IF(U7<4,\"Medio Aseguramiento\",\"Alto Aseguramiento\")))","v":"Alto Aseguramiento"}]
["Segunda Línea de Defensa2",2,"Direccionamiento Estrategico\n\n (Seguimiento Presupuestal)","Alto","Director / Jefe de Oficina","Oficina Asesora de Planeación","X","X","X","Segunda Línea de Defensa","Efectuar seguimiento a la ejecución presupuestal (funcionamiento e inversión)","GIT Proyectos y Presupuesto ","Semestral ","Informe y/o reporte del avance de ejeucción presupuestal (funcionamiento e inversión)",null,"El GIT de Proyectos y Presupuesto de la OAP realiza mensualmente el seguimiento a la ejecución presupuestal de la Entidad a través de la ficha de ejecución presupuestal, tomando como fuente de información los reportes que se generan del sistema de información SIIF. Este ejercicio se complementa posteriormente con un reporte que compara la información reportada en el SPI, SIIF y PAABS, mostrando la coherencia de los recursos por rubro presupuestal en cada sistema y dando alertas a los proyectos de inversión de las diferentes dependencias para ver la consistencia de información. En los casos en que se identifiquen inconsistencias las dependencias realizarán las actualizaciones respectivas bajo los procedimientos establecidos y se realizara el correspondiente seguimiento.\n\nDel mismo modo y con el fin de dar continuidad a la Ruta de la Calidad y la Excelencia, la Oficina Asesora de Planeación, dispuso para la alta dirección de una APP denominada “SEGUIMIENTO A LA  EJECUCION PRESUPUESTAL”  la cual se informa y comunica mensualmente, a través de las mesa de seguimiento y control presupuestal, y tiene como objetivo dar a conocer el seguimiento minucioso de los avances y compromisos presupuestales de funcionamiento e inversión,  de tal manera que permitan la toma oportuna de decisiones a la alta Gerencia, frente a la ejecución de los recursos.\n\nPresentar informe semestral a la Oficina Asesora de Control Interno en el cual se informara sobre aquellos aspectos criticos que consideren pueden generar un riesgo en la entidad. En caso de presentar una situación critica se debe informar de manera inmediata a la Oficina de Control Interno ",4,4,4,4,{"$f":"(Q8*0.2)+(R8*0.3)+(S8*0.3)+(T8*0.2)","v":4},{"$f":"IF(U8<0.9,\" \",IF(U8<3,\"Bajo Aseguramiento\",IF(U8<4,\"Medio Aseguramiento\",\"Alto Aseguramiento\")))","v":"Alto Aseguramiento"},{"$f":"VLOOKUP(V8,Hoja2!$I$3:$O$8,2,0)","v":"La Oficina de Control Interno o quien haga sus veces confiará en los resultados del aseguramiento de la 2ª línea y basado en sus informes, auditará la efectividad de dicha función, evitando evaluar los controles de la 1ª línea."},{"$f":"IFERROR(VLOOKUP(V8,Hoja2!$I$9:$O$13,2,0),\" \")","v":" "}]
{"$rows_left_out":10}
{"sheet":"Mapa de Aseguramiento","index":5,"n_rows":35,"n_cols":8,"rows_kept":35,"cut":false,"hidden":false,"merged":[[0,3,0,7],[1,3,1,7],[3,6,5,6],[4,3,5,3],[0,1,1,2],[3,1,3,5],[3,7,5,7],[4,1,5,1],[4,2,5,2],[4,4,5,4],[4,5,5,5]]}
[null,null,null,"MAPA DE ASEGURAMIENTO"]
[null,null,null,{"$f":"Estructura!C2","v":0}]
[]
[null,"SEGUNDA LÍNEA DE DEFENSA",null,null,null,null,"TERCERA LÍNEA DE DEFENSA\n(Oficina de Control Interno o quien haga sus veces) ","Rol de la Tercera Línea de Defensa"]
[null,"No. ","ASPECTO CLAVE DE ÉXITO\n(Programa, Proyecto, Proceso, Sistema, entre otros)","Riesgo asociado al aspecto clave de éxito","Responsable","Area Funcional"]
[]
[{"$f":"CONCATENATE($B$4,B7)","v":"SEGUNDA LÍNEA DE DEFENSA1"},1,{"$f":"IFERROR(VLOOKUP(A7,'Segunda línea'!$A$7:$X$17,3,FALSE),\"\")","v":"Direccionamiento Estrategico\n\n (Planeación Estratégica)"},{"$f":"IFERROR(VLOOKUP(A7,'Segunda línea'!$A$7:$X$17,4,FALSE),\"\")","v":"Alto"},{"$f":"IFERROR(VLOOKUP(A7,'Segunda línea'!$A$7:$X$17,5,FALSE),\"\")","v":"Director / Jefe de Oficina"},{"$f":"IFERROR(VLOOKUP(A7,'Segunda línea'!$A$7:$X$17,6,FALSE),\"\")","v":"Oficina Asesora de Planeación"},{"$f":"IFERROR(VLOOKUP(A7,'Segunda línea'!$A$7:$X$17,18,FALSE),\"\")","v":4},{"$f":"IFERROR(VLOOKUP(A7,'Segunda línea'!$A$7:$X$17,19,FALSE),\"\")","v":4}]
[{"$f":"CONCATENATE($B$4,B8)","v":"SEGUNDA LÍNEA DE DEFENSA2"},2,{"$f":"IFERROR(VLOOKUP(A8,'Segunda línea'!$A$7:$X$17,3,FALSE),\"\")","v":"Direccionamiento Estrategico\n\n (Seguimiento Presupuestal)"},{"$f":"IFERROR(VLOOKUP(A8,'Segunda línea'!$A$7:$X$17,4,FALSE),\"\")","v":"Alto"},{"$f":"IFERROR(VLOOKUP(A8,'Segunda línea'!$A$7:$X$17,5,FALSE),\"\")","v":"Director / Jefe de Oficina"},{"$f":"IFERROR(VLOOKUP(A8,'Segunda línea'!$A$7:$X$17,6,FALSE),\"\")","v":"Oficina Asesora de Planeación"},{"$f":"IFERROR(VLOOKUP(A8,'Segunda línea'!$A$7:$X$17,18,FALSE),\"\")","v":4},{"$f":"IFERROR(VLOOKUP(A8,'Segunda línea'!$A$7:$X$17,19,FALSE),\"\")","v":4}]
{"$rows_left_out":28}
{"sheet":"Hoja1","index":6,"n_rows":16,"n_cols":7,"rows_kept":16,"cut":false,"hidden":true,"merged":[[4,2,5,2],[4,4,5,4],[4,5,5,5],[4,6,5,6]]}
[]
[]
[]
[]
[null,null,"No. ","ASPECTO CLAVE DE ÉXITO","Riesgo asociado al aspecto clave de éxito","Área Funcional","FUNCIONES DE  ASEGURAMIENTO"]
[null,null,null,"(Programa, Proyecto, Proceso, Sistema, entre otros)"]
[null,null,1,"Direccionamiento Estratégico\n(Planeación Estratégica)","Alto","Oficina Asesora de Planeación ","Efectuar monitoreo institucional a la planeación estratégica"]
[null,null,2,"Direccionamiento Estratégico\n(Seguimiento Presupuestal)","Alto","Oficina Asesora de Planeación ","Efectuar seguimiento a la ejecución presupuestal (funcionamiento e inversión)"]
{"$rows_left_out":9}
{"sheet":"Hoja3","index":7,"n_rows":29,"n_cols":9,"rows_kept":29,"cut":false,"hidden":true,"merged":[[25,8,26,8],[25,9,26,9],[27,1,28,1],[27,3,28,3],[27,4,28,4],[27,5,28,5],[27,6,28,6],[27,7,28,7],[27,8,28,8],[27,9,28,9],[25,1,26,1],[25,3,26,3],[25,4,26,4],[25,5,26,5],[25,6,26,6],[25,7,26,7],[21,8,22,8],[21,9,22,9],[23,1,24,1],[23,3,24,3],[23,4,24,4],[23,5,24,5],[23,6,24,6],[23,7,24,7],[23,8,24,8],[23,9,24,9],[21,1,22,1],[21,2,22,2],[21,3,22,3],[21,4,22,4],[21,5,22,5],[21,6,22,6],[17,9,18,9],[19,1,20,1],[19,3,20,3],[19,5,20,5],[19,6,20,6],[19,7,20,7],[19,8,20,8],[19,9,20,9],[17,1,18,1],[17,3,18,3],[17,5,18,5],[17,6,18,6],[17,7,18,7],[17,8,18,8],[13,9,14,9],[15,1,16,1],[15,3,16,3],[15,5,16,5],[15,6,16,6],[15,7,16,7],[15,8,16,8],[15,9,16,9],[13,1,14,1],[13,3,14,3],[13,5,14,5],[13,6,14,6],[13,7,14,7],[13,8,14,8],[9,9,10,9],[11,1,12,1],[11,3,12,3],[11,5,12,5],[11,6,12,6],[11,7,12,7],[11,8,12,8],[11,9,12,9],[9,1,10,1],[9,3,10,3],[9,5,10,5],[9,6,10,6],[9,7,10,7],[9,8,10,8],[4,1,4,8],[5,1,5,8],[6,1,8,1],[6,3,7,3],[6,4,7,6],[6,7,7,7],[6,8,8,8],[8,4,8,5]]}
[]
[]
[]
[]
[null,"MAPA DE ASEGURAMIENTO 2022"]
[null,"ESTRUCTURA SEGUNDA LÍNEA DE DEFENSA"]
[null,"No.","ASPECTO CLAVE DE ÉXITO","Riesgo asociado al aspecto clave de éxito","Área Funcional",null,null,"FUNCIONES DE ASEGURAMIENTO","FECHA DE CUMPLIMIENTO"]
[null,null,"(Programa, Proyecto, Proceso, Sistema, entre otros)"]
{"$rows_left_out":22}
{"sheet":"Hoja2","index":8,"n_rows":25,"n_cols":10,"rows_kept":25,"cut":false,"hidden":true,"merged":[[6,1,6,6],[13,1,13,6],[20,1,20,6],[2,9,2,14],[3,9,5,14],[3,8,5,8],[6,9,6,14],[8,8,9,8],[10,8,11,8],[8,9,9,14],[10,9,11,14],[12,9,12,14],[7,9,7,14]]}
[]
[]
[null,null,null,null,null,null,null,null,"Bajo Aseguramiento","La Oficina de Control Interno o quien haga sus veces deberá auditar y generar hallazgos y recomendaciones a la función de aseguramiento para su mejora y evaluará los controles de 1ª línea de defensa que corresponderían  a la 2ª línea de defensa."]
[null,null,null,null,null,null,null,null,"Medio Aseguramiento","La Oficina de Control Interno o quien haga sus veces deberá auditar y generar hallazgos y recomendaciones a la función de aseguramiento (2ª línea) para su mejora y evaluará los aspectos que considere relevantes de la 1ª línea de defensa."]
[]
[]
[null,"La Oficina de Control Interno o quien haga sus veces confiará en los resultados del aseguramiento de la 2ª línea y basado en sus informes, auditará la efectividad de dicha función, evitando evaluar los controles de la 1ª línea.\n",null,null,null,null,null,null,"Alto Aseguramiento","La Oficina de Control Interno o quien haga sus veces confiará en los resultados del aseguramiento de la 2ª línea y basado en sus informes, auditará la efectividad de dicha función, evitando evaluar los controles de la 1ª línea."]
[null,null,null,null,null,null,null,null," "," "]
{"$rows_left_out":17}